Makefile Error 64

Makefiles in Windows | Cognitive Waves

Makefiles in Windows | Cognitive Waves

ESE 566A Modern System-on-Chip Design, Spring 2017 Tutorial for VCS

ESE 566A Modern System-on-Chip Design, Spring 2017 Tutorial for VCS

Getting Started with Debugging with Intel® Parallel Studio XE 2017

Getting Started with Debugging with Intel® Parallel Studio XE 2017

5 Ways To Monitor Log or Text File Changes in Real Time • Raymond CC

5 Ways To Monitor Log or Text File Changes in Real Time • Raymond CC

Qt cannot find rc exe Codes: fatal error RC1106: invalid option

Qt cannot find rc exe Codes: fatal error RC1106: invalid option

Help] Getting trouble when following La - C++ Forum

Help] Getting trouble when following La - C++ Forum

File: README — Documentation for extended_bundler-errors (0 3 1)

File: README — Documentation for extended_bundler-errors (0 3 1)

PVS-Studio Documentation (single file)

PVS-Studio Documentation (single file)

Particle Support | Debugging with Eclipse

Particle Support | Debugging with Eclipse

An empirical study of unspecified dependencies in make-based build

An empirical study of unspecified dependencies in make-based build

4 Ways to Fix

4 Ways to Fix "File Explorer has Stopped Working" Error in Windows 10

Compiling Magic Lantern on Windows 10 (using its Linux subsystem)

Compiling Magic Lantern on Windows 10 (using its Linux subsystem)

Add C and C++ code to Your project | Android Developers

Add C and C++ code to Your project | Android Developers

CLion + MinGW Test CMake run finished with errors - Stack Overflow

CLion + MinGW Test CMake run finished with errors - Stack Overflow

Error in invoking target 'all_no_orcl' of makefile | Oracle Jeff

Error in invoking target 'all_no_orcl' of makefile | Oracle Jeff

C++ Tutorial Eclipse CDT & JNI (Java Native Interface) with 64 bit

C++ Tutorial Eclipse CDT & JNI (Java Native Interface) with 64 bit

Commodore 64 assembly coding on the command line

Commodore 64 assembly coding on the command line

Coevolution of variability models and related software artifacts

Coevolution of variability models and related software artifacts

Making sure your Android game is ready for 64-bit - CodeProject

Making sure your Android game is ready for 64-bit - CodeProject

Kdevelop Setup for C/C++ Developers - ICU - International Components

Kdevelop Setup for C/C++ Developers - ICU - International Components

Analyzing Linux kernel crash dumps with crash - The one tutorial

Analyzing Linux kernel crash dumps with crash - The one tutorial

Log Parser Plugin - Jenkins - Jenkins Wiki

Log Parser Plugin - Jenkins - Jenkins Wiki

Installing OpenCV in Ubuntu for Python 3 – Cyan Infinite

Installing OpenCV in Ubuntu for Python 3 – Cyan Infinite

Eclipse Community Forums: C / C++ IDE (CDT) » Import and build a

Eclipse Community Forums: C / C++ IDE (CDT) » Import and build a

How to Build The CP2110/CP2114 HidUartExample in Linux

How to Build The CP2110/CP2114 HidUartExample in Linux

How to XGBoost in Python 3 4 3 | Anaconda 2 2 0 (64-bit) | Kaggle

How to XGBoost in Python 3 4 3 | Anaconda 2 2 0 (64-bit) | Kaggle

How to compile C++ code with VS Code, CMake and NMake - 40tude

How to compile C++ code with VS Code, CMake and NMake - 40tude

Get Started with C++ and Mingw-w64 in Visual Studio Code

Get Started with C++ and Mingw-w64 in Visual Studio Code

How to compile and install Linux Kernel 5 1 14 from source code

How to compile and install Linux Kernel 5 1 14 from source code

Visual studio code Makefile problem - Nordic DevZone

Visual studio code Makefile problem - Nordic DevZone

Installing Ruby Dev Kit on Windows 7 - Google Groups

Installing Ruby Dev Kit on Windows 7 - Google Groups

Migrate to Compiler 6 from gcc - Software Tools blog - Software

Migrate to Compiler 6 from gcc - Software Tools blog - Software

Solved: Amesim/Simulink Interface Building Error - Siemens PLM

Solved: Amesim/Simulink Interface Building Error - Siemens PLM

Qt cannot find rc exe Codes: fatal error RC1106: invalid option

Qt cannot find rc exe Codes: fatal error RC1106: invalid option

CMake error? – IDEs Support (IntelliJ Platform) | JetBrains

CMake error? – IDEs Support (IntelliJ Platform) | JetBrains

Making sure your Android game is ready for 64-bit - CodeProject

Making sure your Android game is ready for 64-bit - CodeProject

Eclipse for JNI development and debugging on Linux (Java and C

Eclipse for JNI development and debugging on Linux (Java and C

Building Cross-Platform CUDA Applications with CMake | NVIDIA

Building Cross-Platform CUDA Applications with CMake | NVIDIA

mvIMPACT Acquire SDK C: Building, Linking And Running Applications

mvIMPACT Acquire SDK C: Building, Linking And Running Applications

Development with GCC and Eclipse - Nordic Blog - Nordic Blog

Development with GCC and Eclipse - Nordic Blog - Nordic Blog

scan-build: running the analyzer from the command line

scan-build: running the analyzer from the command line

PVS-Studio Documentation (single file)

PVS-Studio Documentation (single file)

Issues installing 11 2 0 4 (and 11 2 0 3) on Linux 7 (RHEL7 and OEL7

Issues installing 11 2 0 4 (and 11 2 0 3) on Linux 7 (RHEL7 and OEL7

Apolo Scientific Computing Center's Documentation

Apolo Scientific Computing Center's Documentation

mvIMPACT Acquire SDK C: Building, Linking And Running Applications

mvIMPACT Acquire SDK C: Building, Linking And Running Applications

How to Fix Binkw32 dll Is Missing Errors

How to Fix Binkw32 dll Is Missing Errors

ORACLE APPS DBA STUFFS: DB : Oracle database installation failed

ORACLE APPS DBA STUFFS: DB : Oracle database installation failed

CNS errors before/after recompilation - HADDOCK - BioExcel

CNS errors before/after recompilation - HADDOCK - BioExcel

Makefile error in eclipse - Nordic DevZone

Makefile error in eclipse - Nordic DevZone

OpenSTM32 Community Site | Error while building project for NUCLEO

OpenSTM32 Community Site | Error while building project for NUCLEO

Building offline with Qt Creator IDE | Mbed

Building offline with Qt Creator IDE | Mbed

Compiling for Windows — Godot Engine latest documentation

Compiling for Windows — Godot Engine latest documentation

Solved: Hello, So I'm Suppose To Write Two Codes A Main

Solved: Hello, So I'm Suppose To Write Two Codes A Main

GRUB2 EFI Support | Operating System Technology | System Software

GRUB2 EFI Support | Operating System Technology | System Software

VNDK Build System Support | Android Open Source Project

VNDK Build System Support | Android Open Source Project

mvIMPACT Acquire SDK C: Building, Linking And Running Applications

mvIMPACT Acquire SDK C: Building, Linking And Running Applications

C++ Tutorial Eclipse CDT & JNI (Java Native Interface) with 64 bit

C++ Tutorial Eclipse CDT & JNI (Java Native Interface) with 64 bit

How to Install Oracle 12c on Ubuntu 15 04

How to Install Oracle 12c on Ubuntu 15 04

Joyent Packages Documentation - Install On Illumos

Joyent Packages Documentation - Install On Illumos

C++ Tutorial Eclipse CDT & JNI (Java Native Interface) with 64 bit

C++ Tutorial Eclipse CDT & JNI (Java Native Interface) with 64 bit

Compile Linking Error 64-bit NI-DAQmx C Lib File Location - National

Compile Linking Error 64-bit NI-DAQmx C Lib File Location - National

Set External Mode Code Generation Parameters - MATLAB & Simulink

Set External Mode Code Generation Parameters - MATLAB & Simulink

How to Solve

How to Solve "Error copying file or folders Access is denied" on

Install OpenCV 3 on Windows | Learn OpenCV

Install OpenCV 3 on Windows | Learn OpenCV

Visual Servoing Platform: Tutorial: Installation from source for

Visual Servoing Platform: Tutorial: Installation from source for